Target
Aquaporin-9
Ligand
BDBM454636
Substrate
Meas. Tech.
Calcein Quenching Fluostar Assay
EC50
69.0±n/a nM
Citation
 Evenas, JLarsson, JDreisch, K Compounds for modulating aquaporins US Patent  US10730865 Publication Date 8/4/2020 
Target
Name:
Aquaporin-9
Synonyms:
AQP-9 AQP9_HUMAN SSC1 | Small solute channel 1
Type:
Protein
Mol. Mass.:
31433.73
Organism:
Human
Description:
O43315
Residue:
295
  
Inhibitor
Name:
BDBM454636
Synonyms:
US10730865, Example 27
Type:
Small organic molecule
Emp. Form.:
C19H24N6O2S2
Mol. Mass.:
432.563
SMILES:
CCOc1ccc(cc1)-c1nnc(NC(=O)CSc2nnc(C(C)C)n2CC)s1
: