Target
von Hippel-Lindau disease tumor suppressor
Ligand
BDBM454884
Substrate
Meas. Tech.
Fluorescence Polarization Assay (1% DMSO)
IC50
178±n/a nM
Citation
 Crew, APCrews, CMChen, XDong, HFerraro, CQian, YSiu, KWang, JJin, MBerlin, MZimmermann, KSnyder, L Compounds and methods for the enhanced degradation of targeted proteins US Patent  US10730870 Publication Date 8/4/2020 
Target
Name:
von Hippel-Lindau disease tumor suppressor
Synonyms:
Protein G7 VHL_HUMAN Von Hippel-Lindau disease tumor suppressor protein (VBC) | pVHL
Type:
Protein
Mol. Mass.:
24136.87
Organism:
Homo sapiens (Human)
Description:
P40337
Residue:
213
  
Inhibitor
Name:
BDBM454884
Synonyms:
US10730870, Example 47 | US11512083, Example 47
Type:
Small organic molecule
Emp. Form.:
C30H31N5O4S
Mol. Mass.:
557.663
SMILES:
CC(C)[C@H](N1Cc2cccc(C#N)c2C1=O)C(=O)N1C[C@H](O)C[C@H]1C(=O)NCc1ccc(cc1)-c1scnc1C
: