Target
Toll-like receptor 9
Ligand
BDBM427567
Substrate
Meas. Tech.
TLR7/8/9 Inhibition Reporter Assays
IC50
37.0±n/a nM
Citation
 Dyckman, AJDodd, DSMussari, CPSherwood, TCWhiteley, BKGilmore, JLKumar, SRPasunoori, LSrinivas, PVDuraisamy, SKHegde, SAnumula, RK 4-Azaindole compounds US Patent  US10730877 Publication Date 8/4/2020 
Target
Name:
Toll-like receptor 9
Synonyms:
CD_antigen: CD289 TLR9_HUMAN
Type:
Enzyme
Mol. Mass.:
115889.91
Organism:
Homo sapiens (Human)
Description:
Q9NR96
Residue:
1032
  
Inhibitor
Name:
BDBM427567
Synonyms:
2-(3,4-dimethoxyphenyl)-5-(1′-isobutyl-[1,4′-bipiperidin]-4-yl)-3-methyl-1H-pyrrolo[3,2-b]pyridine US10730877, Example 5 | US11053244, Example 5
Type:
Small organic molecule
Emp. Form.:
C30H42N4O2
Mol. Mass.:
490.6801
SMILES:
COc1ccc(cc1OC)-c1[nH]c2ccc(nc2c1C)C1CCN(CC1)C1CCN(CC(C)C)CC1
: