Target
ATP-sensitive inward rectifier potassium channel 1
Ligand
BDBM456088
Substrate
Meas. Tech.
Thallium Flux Assay
IC50
12.0±n/a nM
Citation
 Gunaga, PBhide, RSBora, ROPanda, MYadav, NDPriestley, ESRichter, J Substituted bicycle heterocyclic derivatives useful as ROMK channel inhibitors US Patent  US10723723 Publication Date 7/28/2020 
Target
Name:
ATP-sensitive inward rectifier potassium channel 1
Synonyms:
ATP-regulated potassium channel ROM-K ATP-sensitive inward rectifier potassium channel 1 KCNJ1 Potassium channel (ATP modulatory) ROMK1 The Renal Outer Medullary Potassium (ROMK)
Type:
Enzyme Catalytic Domain
Mol. Mass.:
44809.08
Organism:
Homo sapiens (Human)
Description:
gi_223460826
Residue:
391
  
Inhibitor
Name:
BDBM456088
Synonyms:
US10723723, Example 45
Type:
Small organic molecule
Emp. Form.:
C20H18N6O3
Mol. Mass.:
390.3953
SMILES:
Cc1c2COC(=O)c2ccc1[C@@H](O)CNCc1cnc(nc1)-n1cnc(c1)C#N
: