Target
ATP-sensitive inward rectifier potassium channel 1
Ligand
BDBM456192
Substrate
Meas. Tech.
Thallium Flux Assay
IC50
14.0±n/a nM
Citation
 Gunaga, PBhide, RSBora, ROPanda, MYadav, NDPriestley, ESRichter, J Substituted bicycle heterocyclic derivatives useful as ROMK channel inhibitors US Patent  US10723723 Publication Date 7/28/2020 
Target
Name:
ATP-sensitive inward rectifier potassium channel 1
Synonyms:
ATP-regulated potassium channel ROM-K ATP-sensitive inward rectifier potassium channel 1 KCNJ1 Potassium channel (ATP modulatory) ROMK1 The Renal Outer Medullary Potassium (ROMK)
Type:
Enzyme Catalytic Domain
Mol. Mass.:
44809.08
Organism:
Homo sapiens (Human)
Description:
gi_223460826
Residue:
391
  
Inhibitor
Name:
BDBM456192
Synonyms:
(R)-1-(5-(((2-hydroxy-2- (4-methyl-1-oxo-1,3- dihydroisobenzofuran-5- yl)ethyl)amino)methyl) pyrimidin-2-yl)-3-methoxy- 1H-pyrazole-4-carbonitrile | US10723723, Example 113
Type:
Small organic molecule
Emp. Form.:
C21H20N6O4
Mol. Mass.:
420.4213
SMILES:
COc1nn(cc1C#N)-c1ncc(CNC[C@H](O)c2ccc3C(=O)OCc3c2C)cn1
: