Target
ATP-sensitive inward rectifier potassium channel 1
Ligand
BDBM456207
Substrate
Meas. Tech.
Thallium Flux Assay
IC50
15.0±n/a nM
Citation
 Gunaga, PBhide, RSBora, ROPanda, MYadav, NDPriestley, ESRichter, J Substituted bicycle heterocyclic derivatives useful as ROMK channel inhibitors US Patent  US10723723 Publication Date 7/28/2020 
Target
Name:
ATP-sensitive inward rectifier potassium channel 1
Synonyms:
ATP-regulated potassium channel ROM-K ATP-sensitive inward rectifier potassium channel 1 KCNJ1 Potassium channel (ATP modulatory) ROMK1 The Renal Outer Medullary Potassium (ROMK)
Type:
Enzyme Catalytic Domain
Mol. Mass.:
44809.08
Organism:
Homo sapiens (Human)
Description:
gi_223460826
Residue:
391
  
Inhibitor
Name:
BDBM456207
Synonyms:
(R)-6-(3-(difluoromethyl)- 4-(((2-hydroxy-2-(4- methyl-1-oxo-1,3- dihydroisobenzofuran-5- yl)ethyl)amino)methyl)- 1H-pyrazol-1-yl)-4- methylnicotinonitrile | US10723723, Example 93
Type:
Small organic molecule
Emp. Form.:
C23H21F2N5O3
Mol. Mass.:
453.4413
SMILES:
Cc1cc(ncc1C#N)-n1cc(CNC[C@H](O)c2ccc3C(=O)OCc3c2C)c(n1)C(F)F
: