Target
ATP-sensitive inward rectifier potassium channel 1
Ligand
BDBM456281
Substrate
Meas. Tech.
Electrophysiology Assay
IC50
11.0±n/a nM
Citation
 Gunaga, PBhide, RSBora, ROPanda, MYadav, NDPriestley, ESRichter, J Substituted bicycle heterocyclic derivatives useful as ROMK channel inhibitors US Patent  US10723723 Publication Date 7/28/2020 
Target
Name:
ATP-sensitive inward rectifier potassium channel 1
Synonyms:
ATP-regulated potassium channel ROM-K ATP-sensitive inward rectifier potassium channel 1 KCNJ1 Potassium channel (ATP modulatory) ROMK1 The Renal Outer Medullary Potassium (ROMK)
Type:
Enzyme Catalytic Domain
Mol. Mass.:
44809.08
Organism:
Homo sapiens (Human)
Description:
gi_223460826
Residue:
391
  
Inhibitor
Name:
BDBM456281
Synonyms:
US10723723, Example 6-I
Type:
Small organic molecule
Emp. Form.:
C25H24N4O5
Mol. Mass.:
460.4819
SMILES:
CN(C[C@H](O)c1ccc2oc(=O)n(C)c2c1)Cc1ccc(nc1)-c1ccc2oc(=O)n(C)c2c1
: