Target
Polyunsaturated fatty acid lipoxygenase ALOX12
Ligand
BDBM50447214
Substrate
Meas. Tech.
UV-vis cuvette-based assay
IC50
510±n/a nM
Citation
 Maloney, DJLuci, DKJadhav, AHolman, TNadler, JLHolinstat, MTaylor-Fishwick, DSimeonov, AYasgar, AMcKenzie, S 4-((2-hydroxy-3-methoxybenzyl)amino)benzenesulfonamide derivatives as potent and selective inhibitors of 12-lipoxygenase US Patent  US10752581 Publication Date 8/25/2020 
Target
Name:
Polyunsaturated fatty acid lipoxygenase ALOX12
Synonyms:
12-LOX 12LO Arachidonate 12-lipoxygenase LOG12 Platelet 12-lipoxygenase | Platelet-type lipoxygenase 12
Type:
Protein
Mol. Mass.:
75689.18
Organism:
Homo sapiens (Human)
Description:
P18054
Residue:
663
  
Inhibitor
Name:
BDBM50447214
Synonyms:
CHEMBL3113179 | US10752581, Compound 49
Type:
Small organic molecule
Emp. Form.:
C24H22N2O4S
Mol. Mass.:
434.507
SMILES:
COc1cccc(CNc2ccc(cc2)S(=O)(=O)Nc2cccc3ccccc23)c1O
: