Target
Isocitrate dehydrogenase [NADP] cytoplasmic [R132C]
Ligand
BDBM458349
Substrate
Meas. Tech.
Biochemical Assay for IDH Inhibition
IC50
12500±n/a nM
Citation
 Yang, J Iso-citrate dehydrogenase (IDH) inhibitor US Patent  US10752626 Publication Date 8/25/2020 
Target
Name:
Isocitrate dehydrogenase [NADP] cytoplasmic [R132C]
Synonyms:
IDH1 IDH1(R132C) Isocitrate dehydrogenase (IDH1)(R132C) Isocitrate dehydrogenase [NADP] cytoplasmic (IDH1) (R132C) | PICD
Type:
Enzyme Catalytic Domain
Mol. Mass.:
46607.23
Organism:
Homo sapiens (Human)
Description:
O75874[R132C]
Residue:
414
  
Inhibitor
Name:
BDBM458349
Synonyms:
US10752626, Compound 5
Type:
Small organic molecule
Emp. Form.:
C19H23N3O
Mol. Mass.:
309.4054
SMILES:
CCCCN1Cc2c(ccnc2N[C@@H](C)c2ccccc2)C1=O
: