Target
Isocitrate dehydrogenase [NADP] cytoplasmic [R132C]
Ligand
BDBM458351
Substrate
Meas. Tech.
Biochemical Assay for IDH Inhibition
IC50
12500±n/a nM
Citation
 Yang, J Iso-citrate dehydrogenase (IDH) inhibitor US Patent  US10752626 Publication Date 8/25/2020 
Target
Name:
Isocitrate dehydrogenase [NADP] cytoplasmic [R132C]
Synonyms:
IDH1 IDH1(R132C) Isocitrate dehydrogenase (IDH1)(R132C) Isocitrate dehydrogenase [NADP] cytoplasmic (IDH1) (R132C) | PICD
Type:
Enzyme Catalytic Domain
Mol. Mass.:
46607.23
Organism:
Homo sapiens (Human)
Description:
O75874[R132C]
Residue:
414
  
Inhibitor
Name:
BDBM458351
Synonyms:
US10752626, Compound 7
Type:
Small organic molecule
Emp. Form.:
C23H23N3O2
Mol. Mass.:
373.4476
SMILES:
COc1ccc(CN2Cc3c(ccnc3N[C@@H](C)c3ccccc3)C2=O)cc1
: