Target
Isocitrate dehydrogenase [NADP] cytoplasmic [R132C]
Ligand
BDBM458356
Substrate
Meas. Tech.
Biochemical Assay for IDH Inhibition
IC50
12500±n/a nM
Citation
 Yang, J Iso-citrate dehydrogenase (IDH) inhibitor US Patent  US10752626 Publication Date 8/25/2020 
Target
Name:
Isocitrate dehydrogenase [NADP] cytoplasmic [R132C]
Synonyms:
IDH1 IDH1(R132C) Isocitrate dehydrogenase (IDH1)(R132C) Isocitrate dehydrogenase [NADP] cytoplasmic (IDH1) (R132C) | PICD
Type:
Enzyme Catalytic Domain
Mol. Mass.:
46607.23
Organism:
Homo sapiens (Human)
Description:
O75874[R132C]
Residue:
414
  
Inhibitor
Name:
BDBM458356
Synonyms:
US10752626, Compound 12
Type:
Small organic molecule
Emp. Form.:
C20H23N3O3
Mol. Mass.:
353.4149
SMILES:
CCOC(=O)c1ccc(cc1)[C@H](C)Nc1nccc2C(=O)N(CC)Cc12
: