Target
Isocitrate dehydrogenase [NADP] cytoplasmic [R132C]
Ligand
BDBM458369
Substrate
Meas. Tech.
Biochemical Assay for IDH Inhibition
IC50
<1500±n/a nM
Citation
 Yang, J Iso-citrate dehydrogenase (IDH) inhibitor US Patent  US10752626 Publication Date 8/25/2020 
Target
Name:
Isocitrate dehydrogenase [NADP] cytoplasmic [R132C]
Synonyms:
IDH1 IDH1(R132C) Isocitrate dehydrogenase (IDH1)(R132C) Isocitrate dehydrogenase [NADP] cytoplasmic (IDH1) (R132C) | PICD
Type:
Enzyme Catalytic Domain
Mol. Mass.:
46607.23
Organism:
Homo sapiens (Human)
Description:
O75874[R132C]
Residue:
414
  
Inhibitor
Name:
BDBM458369
Synonyms:
US10752626, Compound 31
Type:
Small organic molecule
Emp. Form.:
C25H27N3O2
Mol. Mass.:
401.5008
SMILES:
CC(C)N1Cc2c(ccnc2N[C@@H](C)c2ccc(Oc3ccc(C)cc3)cc2)C1=O
: