Target
Tyrosine-protein kinase JAK3 [795-1124]
Ligand
BDBM458946
Substrate
Meas. Tech.
In Vitro JAK kinase Assays
IC50
4.00±n/a nM
Citation
 Esteve Trias, CTaltavull Moll, JGonzalez Rodriguez, JVidal Juan, B 2-(pyrazolopyridin-3-yl)pyrimidine derivatives as JAK inhibitors US Patent  US10759793 Publication Date 9/1/2020 
Target
Name:
Tyrosine-protein kinase JAK3 [795-1124]
Synonyms:
JAK3 Tyrosine-protein kinase JAK3 (795-1124)
Type:
Enzyme Catalytic Domain
Mol. Mass.:
37299.74
Organism:
Homo sapiens (Human)
Description:
aa 795-1124
Residue:
330
  
Inhibitor
Name:
BDBM458946
Synonyms:
US10759793, Example 90
Type:
Small organic molecule
Emp. Form.:
C21H24FN5O5
Mol. Mass.:
445.4442
SMILES:
C[C@H](O)COc1nc(nc(O[C@@H]2CCCN(C2)C(=O)CO)c1F)-c1cnn2ccccc12
: