Target
Fibroblast growth factor receptor 4
Ligand
BDBM88667
Substrate
Meas. Tech.
Omnia Assay Protocol for Potency Assessment Against (method a)
IC50
<100.0±n/a nM
Citation
 D''Agostino, LASjin, RTNiu, DMcDonald, JJZhu, ZLiu, HMazdiyasni, HPetter, RCSingh, JBarrague, MGross, AMunson, M Heteroaryl compounds and uses thereof US Patent  US10774052 Publication Date 9/15/2020 
Target
Name:
Fibroblast growth factor receptor 4
Synonyms:
CD_antigen: CD334 FGFR4 FGFR4 Fibroblast growth factor receptor JK2 TKF
Type:
Protein
Mol. Mass.:
87957.45
Organism:
Homo sapiens (Human)
Description:
P22455
Residue:
802
  
Inhibitor
Name:
BDBM88667
Synonyms:
US10189794, Compound I-30 US10774052, Compound I-30 | US9695132, I-30
Type:
Small organic molecule
Emp. Form.:
C30H36N8O4
Mol. Mass.:
572.658
SMILES:
CCN1CCN(CC1)c1ccc(NC(=O)C=C)c(Nc2ncc3CN(C(=O)N(C)c3n2)c2cc(OC)cc(OC)c2)c1
: