Target
Fibroblast growth factor receptor 4
Ligand
BDBM88686
Substrate
Meas. Tech.
Omnia Assay Protocol for Potency Assessment Against (method a)
IC50
<100.0±n/a nM
Citation
 D''Agostino, LASjin, RTNiu, DMcDonald, JJZhu, ZLiu, HMazdiyasni, HPetter, RCSingh, JBarrague, MGross, AMunson, M Heteroaryl compounds and uses thereof US Patent  US10774052 Publication Date 9/15/2020 
Target
Name:
Fibroblast growth factor receptor 4
Synonyms:
CD_antigen: CD334 FGFR4 FGFR4 Fibroblast growth factor receptor JK2 TKF
Type:
Protein
Mol. Mass.:
87957.45
Organism:
Homo sapiens (Human)
Description:
P22455
Residue:
802
  
Inhibitor
Name:
BDBM88686
Synonyms:
US10189794, Compound I-44 US10774052, Compound I-44 | US9695132, I-44
Type:
Small organic molecule
Emp. Form.:
C29H27N7O4
Mol. Mass.:
537.5692
SMILES:
COc1cc(OC)cc(c1)N1Cc2cnc(Nc3ccccc3NC(=O)C=C)nc2N(Cc2cccnc2)C1=O
: