Target
Dual specificity calcium/calmodulin-dependent 3',5'-cyclic nucleotide phosphodiesterase 1C
Ligand
BDBM279105
Substrate
Meas. Tech.
Inhibition Assay
IC50
100.0±n/a nM
Citation
 Juhl, KJessing, MLanggård, MVital, PJKehler, JRasmussen, LKClementson, CMMarigo, M 1H-pyrazolo[4,3-b]pyridines as PDE1 inhibitors US Patent  US10766893 Publication Date 9/8/2020 
Target
Name:
Dual specificity calcium/calmodulin-dependent 3',5'-cyclic nucleotide phosphodiesterase 1C
Synonyms:
3',5'-cyclic-AMP phosphodiesterase Calcium/calmodulin-dependent 3',5'-cyclic nucleotide phosphodiesterase 1C Hcam3 PDE1C_HUMAN Phosphodiesterase 1C | Phosphodiesterase, PDE1/PDE5
Type:
Enzyme
Mol. Mass.:
80778.58
Organism:
Homo sapiens (Human)
Description:
Q14123
Residue:
709
  
Inhibitor
Name:
BDBM279105
Synonyms:
5-(2-ethoxy-3-pyridyl)-1-[1-methylpropyl]-N-(1H-pyrazol-3-ylmethyl)pyrazolo[4,3-b]pyridin-7-amine, enantiomer 1 US10034861, Example 137 US10766893, Example S137 US11026923, Example 137 US11634416, Example 137
Type:
Small organic molecule
Emp. Form.:
C21H25N7O
Mol. Mass.:
391.4695
SMILES:
CCOc1ncccc1-c1cc(NCc2cc[nH]n2)c2n(ncc2n1)C(C)CC
: