Target
Fatty-acid amide hydrolase 1
Ligand
BDBM280476
Substrate
Meas. Tech.
In Vitro Competitive Activity-Based Protein Profiling Assay
IC50
>1000±n/a nM
Citation
 Buzard, DJShaghafi, MBCisar, JSGrice, CAJones, TKWeber, OD Spirocycle compounds and methods of making and using same US Patent  US10781211 Publication Date 9/22/2020 
Target
Name:
Fatty-acid amide hydrolase 1
Synonyms:
Anandamide amidohydrolase FAAH1_MOUSE Faah1 Fatty-acid amide hydrolase (FAAH) Oleamide hydrolase 1
Type:
Hydrolase; single-pass membrane protein; homodimer
Mol. Mass.:
63227.28
Organism:
Mus musculus (mouse)
Description:
Mouse brain membranes were used in the assay.
Residue:
579
  
Inhibitor
Name:
BDBM280476
Synonyms:
US10030020, Example 21 | US10781211, Example 21
Type:
Small organic molecule
Emp. Form.:
C23H28ClF6N3O3
Mol. Mass.:
543.93
SMILES:
FC(F)(F)C(OC(=O)N1CCC2(CCN(Cc3ccc(Cl)cc3N3CCOCC3)C2)CC1)C(F)(F)F
: