Target
Serine/threonine-protein kinase B-raf
Ligand
BDBM221684
Substrate
Meas. Tech.
Amplified Luminescence Proximity Homogeneous Assay
IC50
0.200±n/a nM
Citation
 Huang, SJin, XLiu, ZPoon, DTellew, JWan, YWang, XXie, Y Compounds and compositions as protein kinase inhibitors US Patent  US9593099 Publication Date 3/14/2017 
Target
Name:
Serine/threonine-protein kinase B-raf
Synonyms:
B-RAF B-Raf proto-oncogene serine/threonine-protein kinase BRAF1 RAFB1 v-Raf murine sarcoma viral oncogene homolog B1
Type:
Serine/threonine-protein kinase
Mol. Mass.:
84446.00
Organism:
Homo sapiens (Human)
Description:
P15056
Residue:
766
  
Inhibitor
Name:
BDBM221684
Synonyms:
US10568884, Cpd 5 US9593100, Compound 5 | USRE49556, Compound 5
Type:
Small organic molecule
Emp. Form.:
C24H32ClN7O4S
Mol. Mass.:
550.073
SMILES:
CCCS(=O)(=O)Nc1cc(Cl)cc(c1)-c1nn(cc1-c1ccnc(NC[C@H](C)NC(=O)OC)n1)C(C)C
: