Target
Serine/threonine-protein kinase B-raf
Ligand
BDBM221705
Substrate
Meas. Tech.
Amplified Luminescence Proximity Homogeneous Assay
IC50
1.70±n/a nM
Citation
 Huang, SJin, XLiu, ZPoon, DTellew, JWan, YWang, XXie, Y Compounds and compositions as protein kinase inhibitors US Patent  US9593099 Publication Date 3/14/2017 
Target
Name:
Serine/threonine-protein kinase B-raf
Synonyms:
B-RAF B-Raf proto-oncogene serine/threonine-protein kinase BRAF1 RAFB1 v-Raf murine sarcoma viral oncogene homolog B1
Type:
Serine/threonine-protein kinase
Mol. Mass.:
84446.00
Organism:
Homo sapiens (Human)
Description:
P15056
Residue:
766
  
Inhibitor
Name:
BDBM221705
Synonyms:
US10568884, Cpd 26 US9593100, Compound 26 | USRE49556, Compound 26
Type:
Small organic molecule
Emp. Form.:
C23H29F2N7O4S
Mol. Mass.:
537.583
SMILES:
CCS(=O)(=O)Nc1c(F)ccc(-c2nn(cc2-c2ccnc(NC[C@H](C)NC(=O)OC)n2)C(C)C)c1F
: