Target
Serine/threonine-protein kinase B-raf
Ligand
BDBM221708
Substrate
Meas. Tech.
Amplified Luminescence Proximity Homogeneous Assay
IC50
8.00±n/a nM
Citation
 Huang, SJin, XLiu, ZPoon, DTellew, JWan, YWang, XXie, Y Compounds and compositions as protein kinase inhibitors US Patent  US9593099 Publication Date 3/14/2017 
Target
Name:
Serine/threonine-protein kinase B-raf
Synonyms:
B-RAF B-Raf proto-oncogene serine/threonine-protein kinase BRAF1 RAFB1 v-Raf murine sarcoma viral oncogene homolog B1
Type:
Serine/threonine-protein kinase
Mol. Mass.:
84446.00
Organism:
Homo sapiens (Human)
Description:
P15056
Residue:
766
  
Inhibitor
Name:
BDBM221708
Synonyms:
US10568884, Cpd 29 US9593100, Compound 29 | USRE49556, Compound 29
Type:
Small organic molecule
Emp. Form.:
C18H20ClFN6O2S
Mol. Mass.:
438.907
SMILES:
CNc1nccc(n1)-c1cn(nc1-c1cc(Cl)cc(NS(C)(=O)=O)c1F)C(C)C
: