Target
Serine/threonine-protein kinase B-raf
Ligand
BDBM221709
Substrate
Meas. Tech.
Amplified Luminescence Proximity Homogeneous Assay
IC50
4.30±n/a nM
Citation
 Huang, SJin, XLiu, ZPoon, DTellew, JWan, YWang, XXie, Y Compounds and compositions as protein kinase inhibitors US Patent  US9593099 Publication Date 3/14/2017 
Target
Name:
Serine/threonine-protein kinase B-raf
Synonyms:
B-RAF B-Raf proto-oncogene serine/threonine-protein kinase BRAF1 RAFB1 v-Raf murine sarcoma viral oncogene homolog B1
Type:
Serine/threonine-protein kinase
Mol. Mass.:
84446.00
Organism:
Homo sapiens (Human)
Description:
P15056
Residue:
766
  
Inhibitor
Name:
BDBM221709
Synonyms:
US10568884, Cpd 30 US9593100, Compound 30 | USRE49556, Compound 30
Type:
Small organic molecule
Emp. Form.:
C17H18ClFN6O2S
Mol. Mass.:
424.88
SMILES:
CC(C)n1cc(c(n1)-c1cc(Cl)cc(NS(C)(=O)=O)c1F)-c1ccnc(N)n1
: