Target
Serine/threonine-protein kinase B-raf
Ligand
BDBM221710
Substrate
Meas. Tech.
Amplified Luminescence Proximity Homogeneous Assay
IC50
0.800±n/a nM
Citation
 Huang, SJin, XLiu, ZPoon, DTellew, JWan, YWang, XXie, Y Compounds and compositions as protein kinase inhibitors US Patent  US9593099 Publication Date 3/14/2017 
Target
Name:
Serine/threonine-protein kinase B-raf
Synonyms:
B-RAF B-Raf proto-oncogene serine/threonine-protein kinase BRAF1 RAFB1 v-Raf murine sarcoma viral oncogene homolog B1
Type:
Serine/threonine-protein kinase
Mol. Mass.:
84446.00
Organism:
Homo sapiens (Human)
Description:
P15056
Residue:
766
  
Inhibitor
Name:
BDBM221710
Synonyms:
US10568884, Cpd 31 US9593100, Compound 31 | USRE49556, Compound 31
Type:
Small organic molecule
Emp. Form.:
C19H21ClFN7O4S
Mol. Mass.:
497.931
SMILES:
COC(=O)N[C@@H](C)CNc1nccc(n1)-c1c[nH]nc1-c1cc(Cl)cc(NS(C)(=O)=O)c1F
: