Target
Interleukin-1 receptor-associated kinase 4
Ligand
BDBM50239497
Substrate
Meas. Tech.
Enzymatic DELFIA Assay
IC50
2.40±n/a nM
Citation
 Trzupek, JDLee, KLBunnage, MEHan, SHepworth, DLovering, FEMathias, JPPapaioannou, NPierce, BSStrohbach, JWWright, SWZapf, CWGavrin, LKLee, AAnderson, DRCurran, KJDehnhardt, CMSaiah, EGoldberg, JAWang, XHuang, HVargas, RLowe, MDPatny, A Bicyclic-fused heteroaryl or aryl compounds US Patent  US10793579 Publication Date 10/6/2020 
Target
Name:
Interleukin-1 receptor-associated kinase 4
Synonyms:
IRAK-4 IRAK4_HUMAN Interleukin-1 receptor-associated kinase 4 (IRAK4) | Renal carcinoma antigen NY-REN-64
Type:
Protein
Mol. Mass.:
51519.08
Organism:
Homo sapiens (Human)
Description:
Q9NWZ3
Residue:
460
  
Inhibitor
Name:
BDBM50239497
Synonyms:
CHEMBL4084228 US10793579, Example 271 | US11702424, Example 271
Type:
Small organic molecule
Emp. Form.:
C18H19N3O4
Mol. Mass.:
341.3612
SMILES:
[H][C@]12[C@H](C)[C@@]1([H])C(=O)N[C@@H]2COc1nccc2cc(C(N)=O)c(OC)cc12
: