Target
D(4) dopamine receptor
Ligand
BDBM466535
Substrate
Meas. Tech.
Evaluation of Binding Activity to Human 5-HT1A Receptor, Human D4 Receptor, and Human D2 Receptor
IC50
11.0±n/a nM
Citation
 Yoshinaga, HUemachi, HOhno, TBesnard, J 2,6-disubstituted pyridine derivative US Patent  US10800755 Publication Date 10/13/2020 
Target
Name:
D(4) dopamine receptor
Synonyms:
D(2C) dopamine receptor DOPAMINE D4.2 DRD4 Dopamine D4 receptor
Type:
Enzyme
Mol. Mass.:
48373.19
Organism:
Homo sapiens (Human)
Description:
P21917
Residue:
419
  
Inhibitor
Name:
BDBM466535
Synonyms:
4,4-Difluoro-N-(2-{4-[6-(trifluoromethyl)pyridin-2-yl]piperidin-1-yl}ethyl)cyclohexane-carboxamide US11014905, Example 1
Type:
Small organic molecule
Emp. Form.:
C20H26F5N3O
Mol. Mass.:
419.432
SMILES:
FC(F)(F)c1cccc(n1)C1CCN(CCNC(=O)C2CCC(F)(F)CC2)CC1
: