Target
D(4) dopamine receptor
Ligand
BDBM466574
Substrate
Meas. Tech.
Evaluation of Binding Activity to Human 5-HT1A Receptor, Human D4 Receptor, and Human D2 Receptor
IC50
104±n/a nM
Citation
 Yoshinaga, HUemachi, HOhno, TBesnard, J 2,6-disubstituted pyridine derivative US Patent  US10800755 Publication Date 10/13/2020 
Target
Name:
D(4) dopamine receptor
Synonyms:
D(2C) dopamine receptor DOPAMINE D4.2 DRD4 Dopamine D4 receptor
Type:
Enzyme
Mol. Mass.:
48373.19
Organism:
Homo sapiens (Human)
Description:
P21917
Residue:
419
  
Inhibitor
Name:
BDBM466574
Synonyms:
US10800755, Example 28 | US11014905, Example 28
Type:
Small organic molecule
Emp. Form.:
C19H26F3N3O3
Mol. Mass.:
401.4232
SMILES:
FC(F)(F)Oc1cccc(n1)C1CCN(CCNC(=O)C2CCOCC2)CC1
: