Target
Cyclin-dependent kinase 2/G1/S-specific cyclin-E1
Ligand
BDBM467012
Substrate
Meas. Tech.
CDK2/Cyclin E1 Mobility Shift Assay
Ki
1.87±n/a nM
Citation
 Behenna, DCChen, PFreeman-Cook, KDHoffman, RLJalaie, MNagata, ANair, SKNinkovic, SOrnelas, MAPalmer, CLRui, EY CDK2/4/6 inhibitors US Patent  US10800783 Publication Date 10/13/2020 
Target
Name:
Cyclin-dependent kinase 2/G1/S-specific cyclin-E1
Synonyms:
CDK2/CycE CDK2/E Cyclin-Dependent Kinase 2 (CDK2) Cyclin-dependent kinase 2/cyclin E1
Type:
Protein
Mol. Mass.:
Description:
Components:
This complex has 2 components.
Component 1
Name:
Cyclin-dependent kinase 2
Synonyms:
CDK2 CDK2_HUMAN Cell division protein kinase 2 Protein cereblon/Cyclin-dependent kinase 2 | p33 protein kinase
Type:
Enzyme Subunit
Mol. Mass.:
33938.17
Organism:
Homo sapiens (Human)
Description:
P24941
Residue:
298
  
Component 2
Name:
G1/S-specific cyclin-E1
Synonyms:
CCNE CCNE1_HUMAN
Type:
Enzyme Subunit
Mol. Mass.:
47073.17
Organism:
Homo sapiens (Human)
Description:
Residue:
410
  
Inhibitor
Name:
BDBM467012
Synonyms:
(+)-6-(2,2-difluoroethyl)-8-[(1R*,2R*)-2-hydroxy-2-methylcyclopentyl]-2-{[1-(methylsulfonyl)piperidin-4-yl]amino}pyrido[2,3-d]pyrimidin-7(8H)-one US11396512, Example 7
Type:
Small organic molecule
Emp. Form.:
C21H29F2N5O4S
Mol. Mass.:
485.548
SMILES:
C[C@]1(O)CCC[C@@H]1n1c2nc(NC3CCN(CC3)S(C)(=O)=O)ncc2cc(CC(F)F)c1=O
: