Target
Cyclin-dependent kinase 6/G1/S-specific cyclin-D1
Ligand
BDBM370223
Substrate
Meas. Tech.
CDK6/Cyclin D1 Mobility Shift Assay
Ki
0.280±n/a nM
Citation
 Behenna, DCChen, PFreeman-Cook, KDHoffman, RLJalaie, MNagata, ANair, SKNinkovic, SOrnelas, MAPalmer, CLRui, EY CDK2/4/6 inhibitors US Patent  US10800783 Publication Date 10/13/2020 
Target
Name:
Cyclin-dependent kinase 6/G1/S-specific cyclin-D1
Synonyms:
CDK6/Cyclin D1
Type:
Enzyme
Mol. Mass.:
Description:
Components:
This complex has 2 components.
Component 1
Name:
Cyclin-dependent kinase 6
Synonyms:
CDK6 CDKN6 Cyclin-dependent kinase 6 (CDK 6) | Serine/threonine-protein kinase PLSTIRE
Type:
Enzyme Subunit
Mol. Mass.:
36937.42
Organism:
Homo sapiens (Human)
Description:
Q00534
Residue:
326
  
Component 2
Name:
G1/S-specific cyclin-D1
Synonyms:
CCND1_MOUSE Cyclin D1 | Cyl-1
Type:
Enzyme Subunit
Mol. Mass.:
33418.84
Organism:
Mus musculus (mouse)
Description:
Residue:
295
  
Inhibitor
Name:
BDBM370223
Synonyms:
US10233188, Example 110 US11396512, Example 110
Type:
Small organic molecule
Emp. Form.:
C21H31N5O4S
Mol. Mass.:
449.567
SMILES:
CCS(=O)(=O)N1CCC(CC1)Nc1ncc2cc(C)c(=O)n([C@@H]3CCC[C@@]3(C)O)c2n1
: