Target
Nociceptin receptor
Ligand
BDBM469378
Substrate
Meas. Tech.
Human Nociceptin/Orphanin FQ Peptide (hNOP) Receptor Binding Assay
Ki
1.000±n/a nM
Citation
 Kuehnert, SKoenigs, RKless, AWegert, AKonetzki, IRatcliffe, PJostock, RKoch, TLinz, KSchroeder, W 3-((hetero-)aryl)-8-amino-2-oxo-1,3-diaza-spiro-[4.5]-decane derivatives US Patent  US10807988 Publication Date 10/20/2020 
Target
Name:
Nociceptin receptor
Synonyms:
KOR-3 Mu-type opioid receptor (Mu) Nociceptin Receptor (ORL1 Receptor) Nociceptin receptor (ORL-1) Nociceptin/Orphanin FQ, NOP receptor OPIATE ORL-1 OPRL1 protein ORL1 Opioid receptor like-1 Orphanin FQ receptor (ORL1) | P41146
Type:
G Protein-Coupled Receptor (GPCR)
Mol. Mass.:
40702.87
Organism:
Homo sapiens (Human)
Description:
P41146
Residue:
370
  
Inhibitor
Name:
BDBM469378
Synonyms:
US10807988, Example SC_3024 | cis-5-[8-Dimethylamino-1-(2-methyl-propy1)-2-oxo-8-phenyl-1,3- diazaspiro[4.5]decan-3-yl]-pyrimidine-2-carbonitrile
Type:
Small organic molecule
Emp. Form.:
C25H32N6O
Mol. Mass.:
432.5612
SMILES:
CC(C)CN1C(=O)N(C[C@]11CC[C@@](CC1)(N(C)C)c1ccccc1)c1cnc(nc1)C#N
: