Target
Nociceptin receptor
Ligand
BDBM469443
Substrate
Meas. Tech.
Human Nociceptin/Orphanin FQ Peptide (hNOP) Receptor Binding Assay
Ki
1.80±n/a nM
Citation
 Kuehnert, SKoenigs, RKless, AWegert, AKonetzki, IRatcliffe, PJostock, RKoch, TLinz, KSchroeder, W 3-((hetero-)aryl)-8-amino-2-oxo-1,3-diaza-spiro-[4.5]-decane derivatives US Patent  US10807988 Publication Date 10/20/2020 
Target
Name:
Nociceptin receptor
Synonyms:
KOR-3 Mu-type opioid receptor (Mu) Nociceptin Receptor (ORL1 Receptor) Nociceptin receptor (ORL-1) Nociceptin/Orphanin FQ, NOP receptor OPIATE ORL-1 OPRL1 protein ORL1 Opioid receptor like-1 Orphanin FQ receptor (ORL1) | P41146
Type:
G Protein-Coupled Receptor (GPCR)
Mol. Mass.:
40702.87
Organism:
Homo sapiens (Human)
Description:
P41146
Residue:
370
  
Inhibitor
Name:
BDBM469443
Synonyms:
US10807988, Example SC_3084 | cis-1-(Cyclobutyl-methyl)-8-dimethylamino-3-[2-methylsulfonyl-4- (trifluoromethyl)-phenyl]-8-phenyl-1,3-diazaspiro[4.5]decan-2-one
Type:
Small organic molecule
Emp. Form.:
C29H36F3N3O3S
Mol. Mass.:
563.675
SMILES:
CN(C)[C@]1(CC[C@]2(CN(C(=O)N2CC2CCC2)c2ccc(cc2S(C)(=O)=O)C(F)(F)F)CC1)c1ccccc1
: