Target
Cyclin-dependent kinase 5 activator 1 [99-307]
Ligand
BDBM7459
Substrate
Histone H1
Meas. Tech.
Kinase Inhibition Assay
pH
7±n/a
Temperature
303.15±n/a K
IC50
3800±n/a nM
Citation
 Lu, HChang, DJBaratte, BMeijer, LSchulze-Gahmen, U Crystal structure of a human cyclin-dependent kinase 6 complex with a flavonol inhibitor, fisetin. J Med Chem 48:737-43 (2005)  
Target
Name:
Cyclin-dependent kinase 5 activator 1 [99-307]
Synonyms:
CDK5/p25 | Cyclin-Dependent Kinase 5 (CDK5)
Type:
Protein Complex
Mol. Mass.:
Description:
Components:
This complex has 2 components.
Component 1
Name:
Cyclin-dependent kinase 5
Synonyms:
CDK5 CDKN5 Cyclin-dependent kinase 5 (CDK5/ p25) Cyclin-dependent-like kinase 5 PSSALRE Tau protein kinase II catalytic subunit
Type:
Enzyme Subunit
Mol. Mass.:
33308.61
Organism:
Homo sapiens (Human)
Description:
Residue:
292
  
Component 2
Name:
Cyclin-dependent kinase 5 activator 1 [99-307]
Synonyms:
CD5R1_HUMAN CDK5R1 Cyclin-dependent kinase 5 activator 1, p25 TPKII regulatory subunit | p25
Type:
Enzyme Subunit
Mol. Mass.:
23250.56
Organism:
Homo sapiens (Human)
Description:
Q15078 aa 99-307
Residue:
209
  
Inhibitor
Name:
BDBM7459
Synonyms:
2-(3,4-dihydroxyphenyl)-5,7-dihydroxy-4H-chromen-4-one CHEMBL151 Luteolin (4) cid_5280445 med.21724, Compound 3
Type:
Small organic molecule
Emp. Form.:
C15H10O6
Mol. Mass.:
286.2363
SMILES:
Oc1cc(O)c2c(c1)oc(cc2=O)-c1ccc(O)c(O)c1
:
Substrate
Name:
Histone H1
Synonyms:
Type:
Other Protein Type
Mol. Mass.:
358.43
Organism:
Bos taurus (bovine)
Description:
Residue:
3
NA