Target
Tyrosine-protein kinase Blk
Ligand
BDBM473174
Substrate
Meas. Tech.
Radioisotope Filter Binding Assay
IC50
<5±n/a nM
Citation
 Mansour, TSEvans, CE 1,2-dithiolane compounds useful in neuroprotection, autoimmune and cancer diseases and conditions US Patent  US10844038 Publication Date 11/24/2020 
Target
Name:
Tyrosine-protein kinase Blk
Synonyms:
B lymphoid tyrosine kinase BLK_HUMAN Tyrosine-protein kinase BLK (BLK) | p55-Blk
Type:
Protein
Mol. Mass.:
57711.88
Organism:
Homo sapiens (Human)
Description:
P51451
Residue:
505
  
Inhibitor
Name:
BDBM473174
Synonyms:
(3S,4R)-3-((4-amino-3-(4-phenoxyphenyl)-1H-pyrazolo[3,4-d]pyrimidin-1-yl)methyl)-1,2-dithiolan-4-ol | US10844038, Example 43 A.
Type:
Small organic molecule
Emp. Form.:
C21H19N5O2S2
Mol. Mass.:
437.538
SMILES:
Nc1ncnc2n(C[C@@H]3SSC[C@H]3O)nc(-c3ccc(Oc4ccccc4)cc3)c12
: