Target
Non-receptor tyrosine-protein kinase TYK2
Ligand
BDBM473560
Substrate
Meas. Tech.
Biochemical Kinase Assay
IC50
1.58±n/a nM
Citation
 Colson, PFass, GT Process for preparing JAK inhibitors and intermediates thereof US Patent  US10844057 Publication Date 11/24/2020 
Target
Name:
Non-receptor tyrosine-protein kinase TYK2
Synonyms:
Non-receptor tyrosine-protein kinase TYK2 (TYK2) TYK2_HUMAN | Tyrosine-protein kinase TYK2
Type:
Protein
Mol. Mass.:
133666.03
Organism:
Homo sapiens (Human)
Description:
P29597
Residue:
1187
  
Inhibitor
Name:
BDBM473560
Synonyms:
US10844057, Example 3
Type:
Small organic molecule
Emp. Form.:
C33H41N7O4
Mol. Mass.:
599.7231
SMILES:
CCc1cc(O)ccc1-c1ccc2c(n[nH]c2c1)-c1nc2C[C@H](N(C)Cc2[nH]1)C(=O)N1CCN(C[C@@H]1C)C(=O)OC(C)(C)C
: