Target
Tyrosine-protein kinase JAK2
Ligand
BDBM473564
Substrate
Meas. Tech.
Biochemical Kinase Assay
Ki
0.032±n/a nM
Citation
 Colson, PFass, GT Process for preparing JAK inhibitors and intermediates thereof US Patent  US10844057 Publication Date 11/24/2020 
Target
Name:
Tyrosine-protein kinase JAK2
Synonyms:
JAK-2 JAK2_HUMAN Janus kinase 2 (JAK2) | Janus kinase 2 (a protein tyrosine kinase)
Type:
Protein
Mol. Mass.:
130684.68
Organism:
Homo sapiens (Human)
Description:
O60674
Residue:
1132
  
Inhibitor
Name:
BDBM473564
Synonyms:
US10844057, Example 7 US11634419, Example 1 | US11702415, Compound 1
Type:
Small organic molecule
Emp. Form.:
C30H37N7O2
Mol. Mass.:
527.6605
SMILES:
CCc1cc(O)ccc1-c1ccc2c(n[nH]c2c1)-c1nc2C[C@H](N(Cc2[nH]1)C(C)C)C(=O)N1CC(C1)N(C)C
: