Target
Non-receptor tyrosine-protein kinase TYK2
Ligand
BDBM473569
Substrate
Meas. Tech.
Biochemical Kinase Assay
IC50
2.00±n/a nM
Citation
 Colson, PFass, GT Process for preparing JAK inhibitors and intermediates thereof US Patent  US10844057 Publication Date 11/24/2020 
Target
Name:
Non-receptor tyrosine-protein kinase TYK2
Synonyms:
Non-receptor tyrosine-protein kinase TYK2 (TYK2) TYK2_HUMAN | Tyrosine-protein kinase TYK2
Type:
Protein
Mol. Mass.:
133666.03
Organism:
Homo sapiens (Human)
Description:
P29597
Residue:
1187
  
Inhibitor
Name:
BDBM473569
Synonyms:
US10844057, Example 12 US11634419, Example 5
Type:
Small organic molecule
Emp. Form.:
C30H37N7O2
Mol. Mass.:
527.6605
SMILES:
CCCN1Cc2[nH]c(nc2C[C@H]1C(=O)N1CC(C1)N(C)C)-c1n[nH]c2cc(ccc12)-c1ccc(O)cc1CC
: