Target
Protein Wnt-3a
Ligand
BDBM300446
Substrate
Meas. Tech.
HCT116 TOPFlash Assay
IC50
17.8±n/a nM
Citation
 Thede, KScott, WBender, EGolz, SHägebarth, ALienau, PPuehler, FBasting, DSchneider, DMöwes, MRichter, AZorn, LLiu, NMönning, USiegel, F Compounds US Patent  US10130633 Publication Date 11/20/2018 
Target
Name:
Protein Wnt-3a
Synonyms:
WNT3A | WNT3A_HUMAN
Type:
PROTEIN
Mol. Mass.:
39379.02
Organism:
Homo sapiens (Human)
Description:
ChEMBL_1469237
Residue:
352
  
Inhibitor
Name:
BDBM300446
Synonyms:
N-{3-[(morpholin-4-ylacetyl)amino]-4-(trifluoromethoxy)phenyl}-5-phenyl-1,3-thiazole-2-carboxamide | US10130633, Example 16
Type:
Small organic molecule
Emp. Form.:
C23H21F3N4O4S
Mol. Mass.:
506.497
SMILES:
FC(F)(F)Oc1ccc(NC(=O)c2ncc(s2)-c2ccccc2)cc1NC(=O)CN1CCOCC1
: