Target
Protein Wnt-3a
Ligand
BDBM300501
Substrate
Meas. Tech.
HCT116 TOPFlash Assay
IC50
29.2±n/a nM
Citation
 Thede, KScott, WBender, EGolz, SHägebarth, ALienau, PPuehler, FBasting, DSchneider, DMöwes, MRichter, AZorn, LLiu, NMönning, USiegel, F Compounds US Patent  US10130633 Publication Date 11/20/2018 
Target
Name:
Protein Wnt-3a
Synonyms:
WNT3A | WNT3A_HUMAN
Type:
PROTEIN
Mol. Mass.:
39379.02
Organism:
Homo sapiens (Human)
Description:
ChEMBL_1469237
Residue:
352
  
Inhibitor
Name:
BDBM300501
Synonyms:
N-[6-(3,5-difluorophenyl)pyridin-3-yl]-3-({[1-(morpholin-4-yl)cyclopropyl]carbonyl}amino)-4-(trifluoromethoxy)benzamide | US10130633, Example 71
Type:
Small organic molecule
Emp. Form.:
C27H23F5N4O4
Mol. Mass.:
562.4879
SMILES:
Fc1cc(F)cc(c1)-c1ccc(NC(=O)c2ccc(OC(F)(F)F)c(NC(=O)C3(CC3)N3CCOCC3)c2)cn1
: