Target
Protein Wnt-3a
Ligand
BDBM300506
Substrate
Meas. Tech.
HCT116 TOPFlash Assay
IC50
31.4±n/a nM
Citation
 Thede, KScott, WBender, EGolz, SHägebarth, ALienau, PPuehler, FBasting, DSchneider, DMöwes, MRichter, AZorn, LLiu, NMönning, USiegel, F Compounds US Patent  US10130633 Publication Date 11/20/2018 
Target
Name:
Protein Wnt-3a
Synonyms:
WNT3A | WNT3A_HUMAN
Type:
PROTEIN
Mol. Mass.:
39379.02
Organism:
Homo sapiens (Human)
Description:
ChEMBL_1469237
Residue:
352
  
Inhibitor
Name:
BDBM300506
Synonyms:
N-[6-(2-fluorophenyl)pyridin-3-yl]-4-methyl-3-({[1-(morpholin-4-yl)cyclopropyl]carbonyl}amino)benzamide | US10130633, Example 76
Type:
Small organic molecule
Emp. Form.:
C27H27FN4O3
Mol. Mass.:
474.5267
SMILES:
Cc1ccc(cc1NC(=O)C1(CC1)N1CCOCC1)C(=O)Nc1ccc(nc1)-c1ccccc1F
: