Target
Protein Wnt-3a
Ligand
BDBM300511
Substrate
Meas. Tech.
HCT116 TOPFlash Assay
IC50
23.1±n/a nM
Citation
 Thede, KScott, WBender, EGolz, SHägebarth, ALienau, PPuehler, FBasting, DSchneider, DMöwes, MRichter, AZorn, LLiu, NMönning, USiegel, F Compounds US Patent  US10130633 Publication Date 11/20/2018 
Target
Name:
Protein Wnt-3a
Synonyms:
WNT3A | WNT3A_HUMAN
Type:
PROTEIN
Mol. Mass.:
39379.02
Organism:
Homo sapiens (Human)
Description:
ChEMBL_1469237
Residue:
352
  
Inhibitor
Name:
BDBM300511
Synonyms:
4-methoxy-3-({[1-(morpholin-4-yl)cyclopropyl]carbonyl}amino)-N-(6-phenylpyridin-3-yl)benzamide | US10130633, Example 81
Type:
Small organic molecule
Emp. Form.:
C27H28N4O4
Mol. Mass.:
472.5356
SMILES:
COc1ccc(cc1NC(=O)C1(CC1)N1CCOCC1)C(=O)Nc1ccc(nc1)-c1ccccc1
: