Target
Protein Wnt-3a
Ligand
BDBM300548
Substrate
Meas. Tech.
HCT116 TOPFlash Assay
IC50
12.6±n/a nM
Citation
 Thede, KScott, WBender, EGolz, SHägebarth, ALienau, PPuehler, FBasting, DSchneider, DMöwes, MRichter, AZorn, LLiu, NMönning, USiegel, F Compounds US Patent  US10130633 Publication Date 11/20/2018 
Target
Name:
Protein Wnt-3a
Synonyms:
WNT3A | WNT3A_HUMAN
Type:
PROTEIN
Mol. Mass.:
39379.02
Organism:
Homo sapiens (Human)
Description:
ChEMBL_1469237
Residue:
352
  
Inhibitor
Name:
BDBM300548
Synonyms:
N-[6-(4-aminophenyl)pyridin-3-yl]-3-{[(2R)-2-(morpholin-4-yl)propanoyl]amino}-4-(trifluoromethoxy)benzamide | US10130633, Example 118
Type:
Small organic molecule
Emp. Form.:
C26H26F3N5O4
Mol. Mass.:
529.5109
SMILES:
C[C@H](N1CCOCC1)C(=O)Nc1cc(ccc1OC(F)(F)F)C(=O)Nc1ccc(nc1)-c1ccc(N)cc1
: