Target
Protein Wnt-3a
Ligand
BDBM300589
Substrate
Meas. Tech.
HCT116 TOPFlash Assay
IC50
41.4±n/a nM
Citation
 Thede, KScott, WBender, EGolz, SHägebarth, ALienau, PPuehler, FBasting, DSchneider, DMöwes, MRichter, AZorn, LLiu, NMönning, USiegel, F Compounds US Patent  US10130633 Publication Date 11/20/2018 
Target
Name:
Protein Wnt-3a
Synonyms:
WNT3A | WNT3A_HUMAN
Type:
PROTEIN
Mol. Mass.:
39379.02
Organism:
Homo sapiens (Human)
Description:
ChEMBL_1469237
Residue:
352
  
Inhibitor
Name:
BDBM300589
Synonyms:
4-(cyclopropyloxy)-3-({[1-(morpholin-4-yl)cyclopropyl]carbonyl}amino)-N-(5-phenyl-1,3,4-thiadiazol-2-yl)benzamide | US10130633, Example 159
Type:
Small organic molecule
Emp. Form.:
C26H27N5O4S
Mol. Mass.:
505.589
SMILES:
O=C(Nc1nnc(s1)-c1ccccc1)c1ccc(OC2CC2)c(NC(=O)C2(CC2)N2CCOCC2)c1
: