Target
Protein Wnt-3a
Ligand
BDBM300675
Substrate
Meas. Tech.
HCT116 TOPFlash Assay
IC50
7.85±n/a nM
Citation
 Thede, KScott, WBender, EGolz, SHägebarth, ALienau, PPuehler, FBasting, DSchneider, DMöwes, MRichter, AZorn, LLiu, NMönning, USiegel, F Compounds US Patent  US10130633 Publication Date 11/20/2018 
Target
Name:
Protein Wnt-3a
Synonyms:
WNT3A | WNT3A_HUMAN
Type:
PROTEIN
Mol. Mass.:
39379.02
Organism:
Homo sapiens (Human)
Description:
ChEMBL_1469237
Residue:
352
  
Inhibitor
Name:
BDBM300675
Synonyms:
N-[6-(3,5- difluorophenyl)pyridin-3-yl]-3- {[2-(morpholin-4- yl)propanoyl]amino}-4- (trifluoromethoxy)benzamide US10130633, Example 246
Type:
Small organic molecule
Emp. Form.:
C26H23F5N4O4
Mol. Mass.:
550.4772
SMILES:
CC(N1CCOCC1)C(=O)Nc1cc(ccc1OC(F)(F)F)C(=O)Nc1ccc(nc1)-c1cc(F)cc(F)c1
: