Target
Protein Wnt-3a
Ligand
BDBM300687
Substrate
Meas. Tech.
HCT116 TOPFlash Assay
IC50
17.0±n/a nM
Citation
 Thede, KScott, WBender, EGolz, SHägebarth, ALienau, PPuehler, FBasting, DSchneider, DMöwes, MRichter, AZorn, LLiu, NMönning, USiegel, F Compounds US Patent  US10130633 Publication Date 11/20/2018 
Target
Name:
Protein Wnt-3a
Synonyms:
WNT3A | WNT3A_HUMAN
Type:
PROTEIN
Mol. Mass.:
39379.02
Organism:
Homo sapiens (Human)
Description:
ChEMBL_1469237
Residue:
352
  
Inhibitor
Name:
BDBM300687
Synonyms:
N-[5-(2-methylphenyl)-1,3,4- thiadiazol-2-yl]-3-({[1- (morpholin-4- yl)cyclopropyl]carbonyl}amino)- 4-(trifluoromethoxy)benzamide | US10130633, Example 257
Type:
Small organic molecule
Emp. Form.:
C25H24F3N5O4S
Mol. Mass.:
547.549
SMILES:
Cc1ccccc1-c1nnc(NC(=O)c2ccc(OC(F)(F)F)c(NC(=O)C3(CC3)N3CCOCC3)c2)s1
: