Target
Protein Wnt-3a
Ligand
BDBM300447
Substrate
Meas. Tech.
HEK TOP OncoFlash Assay
IC50
33.0±n/a nM
Citation
 Thede, KScott, WBender, EGolz, SHägebarth, ALienau, PPuehler, FBasting, DSchneider, DMöwes, MRichter, AZorn, LLiu, NMönning, USiegel, F Compounds US Patent  US10130633 Publication Date 11/20/2018 
Target
Name:
Protein Wnt-3a
Synonyms:
WNT3A | WNT3A_HUMAN
Type:
PROTEIN
Mol. Mass.:
39379.02
Organism:
Homo sapiens (Human)
Description:
ChEMBL_1469237
Residue:
352
  
Inhibitor
Name:
BDBM300447
Synonyms:
N-{3-[(morpholin-4-ylacetyl)amino]-4-(trifluoromethoxy)phenyl}-5-phenylthiophene-2-carboxamide | US10130633, Example 17
Type:
Small organic molecule
Emp. Form.:
C24H22F3N3O4S
Mol. Mass.:
505.509
SMILES:
FC(F)(F)Oc1ccc(NC(=O)c2ccc(s2)-c2ccccc2)cc1NC(=O)CN1CCOCC1
: