Target
Protein Wnt-3a
Ligand
BDBM300497
Substrate
Meas. Tech.
HEK TOP OncoFlash Assay
IC50
13.0±n/a nM
Citation
 Thede, KScott, WBender, EGolz, SHägebarth, ALienau, PPuehler, FBasting, DSchneider, DMöwes, MRichter, AZorn, LLiu, NMönning, USiegel, F Compounds US Patent  US10130633 Publication Date 11/20/2018 
Target
Name:
Protein Wnt-3a
Synonyms:
WNT3A | WNT3A_HUMAN
Type:
PROTEIN
Mol. Mass.:
39379.02
Organism:
Homo sapiens (Human)
Description:
ChEMBL_1469237
Residue:
352
  
Inhibitor
Name:
BDBM300497
Synonyms:
3-({[1-(4-cyclopropylpiperazin-1-yl)cyclopropyl]carbonyl}amino)-N-[6-(2-fluorophenyl)pyridin-3-yl]-4-(trifluoromethoxy)benzamide | US10130633, Example 67
Type:
Small organic molecule
Emp. Form.:
C30H29F4N5O3
Mol. Mass.:
583.5766
SMILES:
Fc1ccccc1-c1ccc(NC(=O)c2ccc(OC(F)(F)F)c(NC(=O)C3(CC3)N3CCN(CC3)C3CC3)c2)cn1
: