Target
DNA damage-binding protein 1/Protein cereblon
Ligand
BDBM475153
Substrate
Meas. Tech.
Fluorescence Polarization (FP) Assay
Kd
<10000±n/a nM
Citation
 Phillips, AJNasveschuk, CGHenderson, JALiang, YHe, MLazarski, KVeits, GKVora, HU C3-carbon linked glutarimide degronimers for target protein degradation US Patent  US10849982 Publication Date 12/1/2020 
Target
Name:
DNA damage-binding protein 1/Protein cereblon
Synonyms:
CRBN-DDB1 Cereblon_DDB1 | Protein cereblon/DNA damage-binding protein 1
Type:
Enzyme
Mol. Mass.:
Description:
Components:
This complex has 2 components.
Component 1
Name:
DNA damage-binding protein 1
Synonyms:
DDB p127 subunit DDB1_HUMAN DNA damage-binding protein a HBV X-associated protein 1 UV-damaged DNA-binding factor XAP-1 XPCe XPE-binding factor | Xeroderma pigmentosum group E-complementing protein
Type:
Protein
Mol. Mass.:
126936.22
Organism:
Homo sapiens (Human)
Description:
Q16531
Residue:
1140
  
Component 2
Name:
Protein cereblon
Synonyms:
CRBN | CRBN_HUMAN
Type:
PROTEIN
Mol. Mass.:
50537.73
Organism:
Homo sapiens (Human)
Description:
ChEMBL_116917
Residue:
442
  
Inhibitor
Name:
BDBM475153
Synonyms:
US10849982, Compd # Degro-nimer 1
Type:
Small organic molecule
Emp. Form.:
C40H44ClN9O4S
Mol. Mass.:
782.353
SMILES:
Cc1sc-2c(c1C)C(=N[C@@H](CC(=O)NCCCCCCCC(=O)Nc1ccc3c(nn(C)c3c1)C1CCC(=O)NC1=O)c1nnc(C)n-21)c1ccc(Cl)cc1
: