Target
High affinity nerve growth factor receptor
Ligand
BDBM373079
Substrate
Meas. Tech.
Kinase Binding Assay
IC50
<100±n/a nM
Citation
 Allen, SBrandhuber, BJKercher, TKolakowski, GRWinski, SL Methods of treatment using pyrrolidinyl urea, thiourea, guanidine and cyanoguanidine compounds US Patent  US10851080 Publication Date 12/1/2020 
Target
Name:
High affinity nerve growth factor receptor
Synonyms:
2.7.10.1 NTRK1 NTRK1_HUMAN Neurotrophic tyrosine kinase receptor type 1 Synonyms=MTC TRK1-transforming tyrosine kinase protein TRKA GN Trk-A Tropomyosin-related kinase A Tyrosine kinase receptor Tyrosine kinase receptor A Tyrosine kinase receptor A (Trk-A) gp140trk | p140-TrkA
Type:
Mol. Mass.:
87498.18
Organism:
Homo sapiens (Human)
Description:
P04629
Residue:
796
  
Inhibitor
Name:
BDBM373079
Synonyms:
US10851080, Example 27 | US9896435, Example 27
Type:
Small organic molecule
Emp. Form.:
C30H33FN6O3
Mol. Mass.:
544.6198
SMILES:
COCCN1C[C@@H](NC(=O)Nc2c(C)c(nn2-c2ccccc2)-c2ccc(=O)n(C)c2)[C@@H](C1)c1cccc(F)c1
: