Target
Genome polyprotein
Ligand
BDBM300775
Substrate
Meas. Tech.
HCV Replicon Luciferase Assay
EC50
16.2±n/a nM
Citation
 Wang, TYin, ZKadow, JF Benzofurans substituted with primary benzamide as HCV inhibitors US Patent  US10131645 Publication Date 11/20/2018 
Target
Name:
Genome polyprotein
Synonyms:
Genome polyprotein RNA polymerase (NS5B)
Type:
Enzyme
Mol. Mass.:
326966.11
Organism:
Hepatitis C virus (HCV)
Description:
Q9WMX2
Residue:
3010
  
Inhibitor
Name:
BDBM300775
Synonyms:
US10131645, Compound 1006
Type:
Small organic molecule
Emp. Form.:
C33H27FN4O3
Mol. Mass.:
546.5909
SMILES:
CCNc1cc2oc(c(C(=O)NC)c2cc1-c1cccc(c1)C(=O)NC(C#N)c1ccccc1)-c1ccc(F)cc1
: