Target
Genome polyprotein
Ligand
BDBM300781
Substrate
Meas. Tech.
HCV Replicon Luciferase Assay
EC50
550±n/a nM
Citation
 Wang, TYin, ZKadow, JF Benzofurans substituted with primary benzamide as HCV inhibitors US Patent  US10131645 Publication Date 11/20/2018 
Target
Name:
Genome polyprotein
Synonyms:
Genome polyprotein RNA polymerase (NS5B)
Type:
Enzyme
Mol. Mass.:
326966.11
Organism:
Hepatitis C virus (HCV)
Description:
Q9WMX2
Residue:
3010
  
Inhibitor
Name:
BDBM300781
Synonyms:
US10131645, Compound 1012
Type:
Small organic molecule
Emp. Form.:
C29H25F4N3O5
Mol. Mass.:
571.5195
SMILES:
CCNc1cc2oc(c(C(=O)NC)c2cc1-c1cccc(c1)C(=O)NC(C(=O)OC)C(F)(F)F)-c1ccc(F)cc1
: