Target
Genome polyprotein
Ligand
BDBM300789
Substrate
Meas. Tech.
HCV Replicon Luciferase Assay
EC50
<100±n/a nM
Citation
 Wang, TYin, ZKadow, JF Benzofurans substituted with primary benzamide as HCV inhibitors US Patent  US10131645 Publication Date 11/20/2018 
Target
Name:
Genome polyprotein
Synonyms:
Genome polyprotein RNA polymerase (NS5B)
Type:
Enzyme
Mol. Mass.:
326966.11
Organism:
Hepatitis C virus (HCV)
Description:
Q9WMX2
Residue:
3010
  
Inhibitor
Name:
BDBM300789
Synonyms:
US10131645, Compound 2008
Type:
Small organic molecule
Emp. Form.:
C39H39FN4O7S
Mol. Mass.:
726.813
SMILES:
CCOc1cc(ccc1OC(C)C)C(NC(=O)c1cccc(c1)-c1cc2c(C(=O)NC)c(oc2cc1N(CC)S(C)(=O)=O)-c1ccc(F)cc1)C#N
: