Target
Genome polyprotein
Ligand
BDBM300800
Substrate
Meas. Tech.
HCV Replicon Luciferase Assay
EC50
946±n/a nM
Citation
 Wang, TYin, ZKadow, JF Benzofurans substituted with primary benzamide as HCV inhibitors US Patent  US10131645 Publication Date 11/20/2018 
Target
Name:
Genome polyprotein
Synonyms:
Genome polyprotein RNA polymerase (NS5B)
Type:
Enzyme
Mol. Mass.:
326966.11
Organism:
Hepatitis C virus (HCV)
Description:
Q9WMX2
Residue:
3010
  
Inhibitor
Name:
BDBM300800
Synonyms:
US10131645, Compound 6004
Type:
Small organic molecule
Emp. Form.:
C32H32FN3O6
Mol. Mass.:
573.6114
SMILES:
CCN(CC)c1cc2oc(c(C(=O)NC)c2cc1-c1cccc(c1)C(=O)N[C@@]1(C[C@@H]1CO)C(O)=O)-c1ccc(F)cc1
: